{"text_format":"1","workbook":"xlsx","n_sheets":11,"sheets":["Instructions","Introduction","Data Table","Planning","Reporting","Optional Reporting","Input","Plots","Consolidation","Program Period","Consolidation old"],"not_rendered":{"charts":3,"images":0,"macros":1,"external_links":0,"defined_names":15,"comments":3,"pivot_tables":0},"unopened":[],"bounds":{"document_bytes":16777216,"sheet_cells":100000,"rows_first":2000,"rows_last":500,"rows_between":2000,"halvings":0,"cell_chars":16384,"cell_head_chars":4096},"cells_cut":0,"cells_raw":0,"read":"whole","date_system":"1900"}

{"sheet":"Instructions","index":0,"n_rows":0,"n_cols":0,"rows_kept":0,"cut":false,"hidden":true,"merged":[]}

{"sheet":"Introduction","index":1,"n_rows":12,"n_cols":3,"rows_kept":12,"cut":false,"hidden":false,"merged":[[2,1,5,13],[11,2,13,12]]}
[]
[]
[null,"To get started, please enable macro and review the training brief attached below. The Data Table tab also provides important information on each required data element. After reviewing the material, please go to the Planning tab to get started. You will find Directions at the top of each tab that will be helpful in providing the required data.\n\nFor any questions on the content and submission of the reliability growth data, please contact Mr. Andrew Monje, OUSD(AT&L)/SE , at (703) 692-0841, Andrew.Monje@osd.mil or Mr. Alan Fu, OUSD(AT&L)/SE, at (703) 695-7793, Alan.Fu.ctr@osd.mil."]
[]
[]
[]
{"$rows_left_out":7}
{"sheet":"Data Table","index":2,"n_rows":19,"n_cols":7,"rows_kept":19,"cut":false,"hidden":false,"merged":[[1,0,7,0],[8,0,10,0],[11,0,13,0],[14,0,18,0]]}
[null,"RGC Data Element Number","Data Element Name","Input Frequency","Description","Examples (non-exhaustive)","Data Input Guidance"]
["Planning",1,"Reliability Metric","Once","The metric being used by the program to measure reliability.","MTBF, MTBOMF, MTBSA, Percentage, Mean Shots Between Failures, Mean Miles Between System Aborts","The reliability life unit should be traceable to the reliability requirement and what reliability metric the requirement is expressed in."]
[null,2,"Test Length Unit","Once","The metric being used by the program to measure time, distance, rounds, attempts, etc.; the x-axis unit when plotting reliability","Hours, Flight Hours, Miles, Shots","The test length unit should support and be consistent with the reliability life unit (e.g. if the reliability life unit is Mean Time Between Failures, the test length unit should be a unit of time"]
[null,3,"Reliability Threshold ","Once","The reliability threshold for the program, traceable to the program CDD/CPD","Positive integer or percentage","The reliability threshold must be the value defined in the approved CDD or CPD."]
[null,4,"Planned Initial Reliability","Once","The planned initial reliability value of the RGC; the planned reliability at time zero on the RGC","Positive integer or percentage","The planned initial reliability value should be extracted from the SEP and TEMP and should represent the planned reliability of the system when full-up system level DT commences."]
[null,5,"Fiscal Year/Quarter","Once","The beginning and end of the reliability growth program, expressed in fiscal year and quarter.","FY12Q4 to FY14Q1, FY13Q1 to FY17Q4","For both the start and end of the reliability test program, select the fiscal year and then the specific quarter for the start/end. A table will generate with the specified range, in quarterly increments. "]
{"$rows_left_out":14}
{"sheet":"Planning","index":3,"n_rows":25,"n_cols":10,"rows_kept":25,"cut":false,"hidden":false,"merged":[[42,4,42,5],[42,7,42,8],[43,4,43,5],[43,7,43,8],[44,4,44,5],[44,7,44,8],[39,4,39,5],[39,7,39,8],[40,4,40,5],[40,7,40,8],[41,4,41,5],[41,7,41,8],[36,4,36,5],[36,7,36,8],[37,4,37,5],[37,7,37,8],[38,4,38,5],[38,7,38,8],[33,4,33,5],[33,7,33,8],[34,4,34,5],[34,7,34,8],[35,4,35,5],[35,7,35,8],[30,4,30,5],[30,7,30,8],[31,4,31,5],[31,7,31,8],[32,4,32,5],[32,7,32,8],[27,4,27,5],[27,7,27,8],[28,4,28,5],[28,7,28,8],[29,4,29,5],[29,7,29,8],[42,1,42,2],[43,1,43,2],[44,1,44,2],[45,1,45,2],[24,4,24,5],[36,1,36,2],[37,1,37,2],[38,1,38,2],[39,1,39,2],[40,1,40,2],[41,1,41,2],[30,1,30,2],[31,1,31,2],[32,1,32,2],[33,1,33,2],[34,1,34,2],[24,7,24,8],[25,4,25,5],[25,7,25,8],[26,4,26,5],[26,7,26,8],[35,1,35,2],[24,1,24,2],[25,1,25,2],[26,1,26,2],[27,1,27,2],[28,1,28,2],[29,1,29,2],[6,9,8,11],[22,6,23,8],[21,0,21,7],[0,0,0,1],[19,0,20,2],[22,0,23,2],[22,3,23,5],[6,5,7,5],[8,5,9,5],[10,5,10,6],[2,0,2,7]]}
["Planning Section"]
[]
["Directions: The yellow highlighted boxes below will guide your data entry. Comments have been included for assistance. To begin, select the appropriate start and end dates (Fiscal year and quarter) for the system level testing on the right and hit \"Generate Table\". For the quarterly test length and cumulative reliability table, fill out as many quarters as necessary consistent with the documented planned values on the reliability growth curve in the Systems Engineering Plan (SEP) and Test & Evaluation Master Plan (TEMP)."]
[]
["Program Name:"]
["Service: ",null,{"$f":"IF(B6=\"Other\", \"Please Specify:\", \"\" )","v":""}]
{"$rows_left_out":20}
{"sheet":"Reporting","index":4,"n_rows":26,"n_cols":182,"rows_kept":26,"cut":false,"hidden":false,"merged":[[45,5,45,7],[3,0,3,5],[45,3,45,4],[25,5,25,7],[23,3,24,7],[26,5,26,7],[27,5,27,7],[28,5,28,7],[29,5,29,7],[30,5,30,7],[31,5,31,7],[32,5,32,7],[45,1,45,2],[25,3,25,4],[26,3,26,4],[27,3,27,4],[43,5,43,7],[44,5,44,7],[41,1,41,2],[42,1,42,2],[41,3,41,4],[42,3,42,4],[41,5,41,7],[42,5,42,7],[43,1,43,2],[44,1,44,2],[43,3,43,4],[44,3,44,4],[39,5,39,7],[40,5,40,7],[37,1,37,2],[38,1,38,2],[37,3,37,4],[38,3,38,4],[37,5,37,7],[38,5,38,7],[39,1,39,2],[40,1,40,2],[39,3,39,4],[40,3,40,4],[35,5,35,7],[36,5,36,7],[33,1,33,2],[34,1,34,2],[33,3,33,4],[34,3,34,4],[33,5,33,7],[34,5,34,7],[35,1,35,2],[36,1,36,2],[35,3,35,4],[36,3,36,4],[32,1,32,2],[31,3,31,4],[32,3,32,4],[29,1,29,2],[30,1,30,2],[29,3,29,4],[30,3,30,4],[31,1,31,2],[0,0,0,1],[2,0,2,6],[27,1,27,2],[28,1,28,2],[25,1,25,2],[26,1,26,2],[4,0,4,3],[20,0,21,2],[22,0,22,7],[23,0,24,2],[28,3,28,4]]}
["Reporting Section"]
[]
["Introduction: The planned values have been extracted from the \"Planning\" tab. If you do not see the planned values, please make sure the \"Planning\" tab has been filled in. This tab tracks the actuals for test length i.e. how many hours of testing actually occurred in the quarter as well as demonstrated cumulative reliability. Cumulative reliability here is defined as total test length divided by total number of failures."]
["Directions: Please fill out \"Actual Cumulative Test Length\", \"Cumulative Demonstrated Reliability\", and \"Projected Reliability for next quarter\". Keep in mind that the first two requested values are CUMULATIVE and not referring to the test time or reliability for the current quarter. Those values will be calculated automatically below. To explain any deviation from planned values, you may use the \"Deviation from planned values\" section below."]
["Optional Reporting: If the current test phase better reflects the reliability of the program, you may use the \"Optional Reporting\" tab to report those values. However, that is in addition to the three required values specified in the Directions above."]
[]
{"$rows_left_out":21}
{"sheet":"Optional Reporting","index":5,"n_rows":17,"n_cols":182,"rows_kept":17,"cut":false,"hidden":false,"merged":[[2,0,2,6],[3,0,3,3],[4,0,4,3],[0,0,0,2],[6,1,6,4]]}
["Optional Reporting Section"]
[]
["Introduction: If the current test phase better reflects the reliability of the program, you may use this tab to report those values. However, that is in addition to the three required values specified in the \"Reporting\" tab."]
["Directions: Please fill out \"Current Test Phase - Actual Cumulative Test Length\" and \" Current Test Phase - Cumulative Demonstrated Reliability\". Keep in mind that these values are CUMULATIVE and not referring to the test time or reliability for the current quarter. Those values will be calculated automatically below. "]
["IMPORTANT: This is an optional reporting requirement so not all quarters have to be filled out. If you do choose to enter the current test phase data, you are required to continue entering this data until at least the end of the current test phase."]
[]
{"$rows_left_out":12}
{"sheet":"Input","index":6,"n_rows":7,"n_cols":8,"rows_kept":7,"cut":false,"hidden":true,"merged":[]}
["Army",null,"MTBF",null,null,null,null,"Hours"]
["Navy",null,"MTBOMF",null,null,null,null,"Flight Hours"]
["Air Force",null,"MTBSA",null,null,null,null,"Cycles"]
["Other",null,"Percent Reliability",null,null,null,null,"Miles"]
[null,null,"Probability",null,null,null,null,"Rounds"]
[null,null,"Other",null,null,null,null,"Shots"]
{"$rows_left_out":2}
{"sheet":"Plots","index":7,"n_rows":0,"n_cols":0,"rows_kept":0,"cut":false,"hidden":false,"merged":[]}

{"sheet":"Consolidation","index":8,"n_rows":199,"n_cols":14,"rows_kept":199,"cut":false,"hidden":true,"merged":[]}
["Fiscal Year Quarter","FY2","Planned Time 2","Actual Time 2","Reliability Threshold Value","Planned Initial Reliability:","Planned Cumulative Test Length","Planned Cumulative Reliability","Actual Cumulative Test Length","Cumulative Demonstrated Reliability Value","Quarterly Demonstrated Reliabilty","Current Test Phase - Cumulative Demonstrated Reliability Value","Current Test Phase - Quarterly Demonstrated Reliabilty","Projected Reliability for next quarter"]
["Planned","FY13Q1",{"$f":"IF(ISBLANK(INDEX(Planning!$B$16:$FZ$16,ROW(A1))),\"\",INDEX(Planning!$B$16:$FZ$16,ROW(A1)))","v":""},{"$f":"IF(ISBLANK(INDEX(Reporting!$B$9:$FZ$9,ROW(A1))),\"\",INDEX(Reporting!$B$9:$FZ$9,ROW(A1)))","v":""},{"$f":"IF(OR(IF(ISBLANK(A2),TRUE,FALSE),ISBLANK(Planning!$B$11)),\"\",Planning!$B$11)","v":""},{"$f":"IF(ISBLANK(Planning!B13),\"\",Planning!B13)","v":""},null,{"$f":"F2","v":""},null,{"$f":"F2","v":""},{"$f":"F2","v":""}]
["FY13Q1","FY13Q2",{"$f":"IF(ISBLANK(INDEX(Planning!$B$16:$FZ$16,ROW(A2))),\"\",INDEX(Planning!$B$16:$FZ$16,ROW(A2)))","v":""},{"$f":"IF(ISBLANK(INDEX(Reporting!$B$9:$FZ$9,ROW(A2))),\"\",INDEX(Reporting!$B$9:$FZ$9,ROW(A2)))","v":""},{"$f":"IF(OR(IF(ISBLANK(A3),TRUE,FALSE),ISBLANK(Planning!$B$11)),\"\",Planning!$B$11)","v":""},null,{"$f":"IF(ISBLANK(INDEX(Planning!$B$16:$FZ$16,ROW(A1))),\"\",INDEX(Planning!$B$16:$FZ$16,ROW(A1)))","v":""},{"$f":"IF(ISBLANK(INDEX(Planning!$B$17:$FZ$17,ROW(A1))),\"\",INDEX(Planning!$B$17:$FZ$17,ROW(A1)))","v":""},{"$f":"IF(ISBLANK(INDEX(Reporting!$B$9:$FZ$9,ROW(A1))),\"\",INDEX(Reporting!$B$9:$FZ$9,ROW(A1)))","v":""},{"$f":"IF(ISBLANK(INDEX(Reporting!$B$11:$FZ$11,ROW(A1))),\"\",INDEX(Reporting!$B$11:$FZ$11,ROW(A1)))","v":""},{"$f":"IF(ISBLANK(INDEX(Reporting!$B$18:$FZ$18,ROW(A1))),\"\",IF(INDEX(Reporting!$B$18:$FZ$18,ROW(A1))=\"No Failures Observed\",NA(),INDEX(Reporting!$B$18:$FZ$18,ROW(A1))))","v":""},{"$f":"IF(ISBLANK(INDEX('Optional Reporting'!$B$11:$FZ$11,ROW(A1))),NA(),INDEX('Optional Reporting'!$B$11:$FZ$11,ROW(A1)))","v":{"$error":"#N/A"}},{"$f":"IF((INDEX('Optional Reporting'!$B$17:$FZ$17,ROW(A1)))=\"\",NA(),INDEX('Optional Reporting'!$B$17:$FZ$17,ROW(A1)))","v":{"$error":"#N/A"}},{"$f":"NA()","v":{"$error":"#N/A"}}]
["FY13Q2","FY13Q3",{"$f":"IF(ISBLANK(INDEX(Planning!$B$16:$FZ$16,ROW(A3))),\"\",INDEX(Planning!$B$16:$FZ$16,ROW(A3)))","v":""},{"$f":"IF(ISBLANK(INDEX(Reporting!$B$9:$FZ$9,ROW(A3))),\"\",INDEX(Reporting!$B$9:$FZ$9,ROW(A3)))","v":""},{"$f":"IF(OR(IF(ISBLANK(A4),TRUE,FALSE),ISBLANK(Planning!$B$11)),\"\",Planning!$B$11)","v":""},null,{"$f":"IF(ISBLANK(INDEX(Planning!$B$16:$FZ$16,ROW(A2))),\"\",INDEX(Planning!$B$16:$FZ$16,ROW(A2)))","v":""},{"$f":"IF(ISBLANK(INDEX(Planning!$B$17:$FZ$17,ROW(A2))),\"\",INDEX(Planning!$B$17:$FZ$17,ROW(A2)))","v":""},{"$f":"IF(ISBLANK(INDEX(Reporting!$B$9:$FZ$9,ROW(A2))),\"\",INDEX(Reporting!$B$9:$FZ$9,ROW(A2)))","v":""},{"$f":"IF(ISBLANK(INDEX(Reporting!$B$11:$FZ$11,ROW(A2))),\"\",INDEX(Reporting!$B$11:$FZ$11,ROW(A2)))","v":""},{"$f":"IF(ISBLANK(INDEX(Reporting!$B$18:$FZ$18,ROW(A2))),\"\",IF(INDEX(Reporting!$B$18:$FZ$18,ROW(A2))=\"No Failures Observed\",NA(),INDEX(Reporting!$B$18:$FZ$18,ROW(A2))))","v":""},{"$f":"IF(ISBLANK(INDEX('Optional Reporting'!$B$11:$FZ$11,ROW(A2))),NA(),INDEX('Optional Reporting'!$B$11:$FZ$11,ROW(A2)))","v":{"$error":"#N/A"}},{"$f":"IF((INDEX('Optional Reporting'!$B$17:$FZ$17,ROW(A2)))=\"\",NA(),INDEX('Optional Reporting'!$B$17:$FZ$17,ROW(A2)))","v":{"$error":"#N/A"}},{"$f":"IF(ISBLANK(INDEX(Reporting!$B$12:$FZ$12,ROW(A1))),\"\",INDEX(Reporting!$B$12:$FZ$12,ROW(A1)))","v":""}]
["FY13Q3","FY13Q4",{"$f":"IF(ISBLANK(INDEX(Planning!$B$16:$FZ$16,ROW(A4))),\"\",INDEX(Planning!$B$16:$FZ$16,ROW(A4)))","v":""},{"$f":"IF(ISBLANK(INDEX(Reporting!$B$9:$FZ$9,ROW(A4))),\"\",INDEX(Reporting!$B$9:$FZ$9,ROW(A4)))","v":""},{"$f":"IF(OR(IF(ISBLANK(A5),TRUE,FALSE),ISBLANK(Planning!$B$11)),\"\",Planning!$B$11)","v":""},null,{"$f":"IF(ISBLANK(INDEX(Planning!$B$16:$FZ$16,ROW(A3))),\"\",INDEX(Planning!$B$16:$FZ$16,ROW(A3)))","v":""},{"$f":"IF(ISBLANK(INDEX(Planning!$B$17:$FZ$17,ROW(A3))),\"\",INDEX(Planning!$B$17:$FZ$17,ROW(A3)))","v":""},{"$f":"IF(ISBLANK(INDEX(Reporting!$B$9:$FZ$9,ROW(A3))),\"\",INDEX(Reporting!$B$9:$FZ$9,ROW(A3)))","v":""},{"$f":"IF(ISBLANK(INDEX(Reporting!$B$11:$FZ$11,ROW(A3))),\"\",INDEX(Reporting!$B$11:$FZ$11,ROW(A3)))","v":""},{"$f":"IF(ISBLANK(INDEX(Reporting!$B$18:$FZ$18,ROW(A3))),\"\",IF(INDEX(Reporting!$B$18:$FZ$18,ROW(A3))=\"No Failures Observed\",NA(),INDEX(Reporting!$B$18:$FZ$18,ROW(A3))))","v":""},{"$f":"IF(ISBLANK(INDEX('Optional Reporting'!$B$11:$FZ$11,ROW(A3))),NA(),INDEX('Optional Reporting'!$B$11:$FZ$11,ROW(A3)))","v":{"$error":"#N/A"}},{"$f":"IF((INDEX('Optional Reporting'!$B$17:$FZ$17,ROW(A3)))=\"\",NA(),INDEX('Optional Reporting'!$B$17:$FZ$17,ROW(A3)))","v":{"$error":"#N/A"}},{"$f":"IF(ISBLANK(INDEX(Reporting!$B$12:$FZ$12,ROW(A2))),\"\",INDEX(Reporting!$B$12:$FZ$12,ROW(A2)))","v":""}]
["FY13Q4","FY14Q1",{"$f":"IF(ISBLANK(INDEX(Planning!$B$16:$FZ$16,ROW(A5))),\"\",INDEX(Planning!$B$16:$FZ$16,ROW(A5)))","v":""},{"$f":"IF(ISBLANK(INDEX(Reporting!$B$9:$FZ$9,ROW(A5))),\"\",INDEX(Reporting!$B$9:$FZ$9,ROW(A5)))","v":""},{"$f":"IF(OR(IF(ISBLANK(A6),TRUE,FALSE),ISBLANK(Planning!$B$11)),\"\",Planning!$B$11)","v":""},null,{"$f":"IF(ISBLANK(INDEX(Planning!$B$16:$FZ$16,ROW(A4))),\"\",INDEX(Planning!$B$16:$FZ$16,ROW(A4)))","v":""},{"$f":"IF(ISBLANK(INDEX(Planning!$B$17:$FZ$17,ROW(A4))),\"\",INDEX(Planning!$B$17:$FZ$17,ROW(A4)))","v":""},{"$f":"IF(ISBLANK(INDEX(Reporting!$B$9:$FZ$9,ROW(A4))),\"\",INDEX(Reporting!$B$9:$FZ$9,ROW(A4)))","v":""},{"$f":"IF(ISBLANK(INDEX(Reporting!$B$11:$FZ$11,ROW(A4))),\"\",INDEX(Reporting!$B$11:$FZ$11,ROW(A4)))","v":""},{"$f":"IF(ISBLANK(INDEX(Reporting!$B$18:$FZ$18,ROW(A4))),\"\",IF(INDEX(Reporting!$B$18:$FZ$18,ROW(A4))=\"No Failures Observed\",NA(),INDEX(Reporting!$B$18:$FZ$18,ROW(A4))))","v":""},{"$f":"IF(ISBLANK(INDEX('Optional Reporting'!$B$11:$FZ$11,ROW(A4))),NA(),INDEX('Optional Reporting'!$B$11:$FZ$11,ROW(A4)))","v":{"$error":"#N/A"}},{"$f":"IF((INDEX('Optional Reporting'!$B$17:$FZ$17,ROW(A4)))=\"\",NA(),INDEX('Optional Reporting'!$B$17:$FZ$17,ROW(A4)))","v":{"$error":"#N/A"}},{"$f":"IF(ISBLANK(INDEX(Reporting!$B$12:$FZ$12,ROW(A3))),\"\",INDEX(Reporting!$B$12:$FZ$12,ROW(A3)))","v":""}]
{"$rows_left_out":194}
{"sheet":"Program Period","index":9,"n_rows":37,"n_cols":2,"rows_kept":37,"cut":false,"hidden":true,"merged":[]}
["FY","Q"]
[10,1]
[{"$f":"A2+1","v":11},2]
[{"$f":"A3+1","v":12},3]
[13,4]
[14]
{"$rows_left_out":32}
{"sheet":"Consolidation old","index":10,"n_rows":27,"n_cols":22,"rows_kept":27,"cut":false,"hidden":true,"merged":[]}
[{"$f":"Planning!A15","v":"Fiscal Year Quarter"},"Planned","FY12Q1","FY12Q2","FY12Q3","FY12Q4","FY13Q1","FY13Q2","FY13Q3","FY13Q4","FY14Q1","FY14Q2","FY14Q3","FY14Q4","FY15Q1","FY15Q2","FY15Q3","FY15Q4","FY16Q1","FY16Q2","FY16Q3","FY16Q4"]
[{"$f":"Planning!A13","v":"Planned Initial Reliability:"},{"$f":"Planning!B13","v":0},{"$f":"NA()","v":{"$error":"#N/A"}},{"$f":"NA()","v":{"$error":"#N/A"}},{"$f":"NA()","v":{"$error":"#N/A"}},{"$f":"NA()","v":{"$error":"#N/A"}},{"$f":"NA()","v":{"$error":"#N/A"}},{"$f":"NA()","v":{"$error":"#N/A"}},{"$f":"NA()","v":{"$error":"#N/A"}},{"$f":"NA()","v":{"$error":"#N/A"}},{"$f":"NA()","v":{"$error":"#N/A"}},{"$f":"NA()","v":{"$error":"#N/A"}},{"$f":"NA()","v":{"$error":"#N/A"}},{"$f":"NA()","v":{"$error":"#N/A"}},{"$f":"NA()","v":{"$error":"#N/A"}},{"$f":"NA()","v":{"$error":"#N/A"}},{"$f":"NA()","v":{"$error":"#N/A"}},{"$f":"NA()","v":{"$error":"#N/A"}},{"$f":"NA()","v":{"$error":"#N/A"}},{"$f":"NA()","v":{"$error":"#N/A"}},{"$f":"NA()","v":{"$error":"#N/A"}},{"$f":"NA()","v":{"$error":"#N/A"}}]
[{"$f":"Planning!A17","v":"Planned Cumulative Reliability"},null,{"$f":"IF(ISBLANK(Planning!B17),NA(),Planning!B17)","v":{"$error":"#N/A"}},{"$f":"IF(ISBLANK(Planning!C17),NA(),Planning!C17)","v":{"$error":"#N/A"}},{"$f":"IF(ISBLANK(Planning!D17),NA(),Planning!D17)","v":{"$error":"#N/A"}},{"$f":"IF(ISBLANK(Planning!E17),NA(),Planning!E17)","v":{"$error":"#N/A"}},{"$f":"IF(ISBLANK(Planning!F17),NA(),Planning!F17)","v":{"$error":"#N/A"}},{"$f":"IF(ISBLANK(Planning!G17),NA(),Planning!G17)","v":{"$error":"#N/A"}},{"$f":"IF(ISBLANK(Planning!H17),NA(),Planning!H17)","v":{"$error":"#N/A"}},{"$f":"IF(ISBLANK(Planning!I17),NA(),Planning!I17)","v":{"$error":"#N/A"}},{"$f":"IF(ISBLANK(Planning!J17),NA(),Planning!J17)","v":{"$error":"#N/A"}},{"$f":"IF(ISBLANK(Planning!K17),NA(),Planning!K17)","v":{"$error":"#N/A"}},{"$f":"IF(ISBLANK(Planning!L17),NA(),Planning!L17)","v":{"$error":"#N/A"}},{"$f":"IF(ISBLANK(Planning!M17),NA(),Planning!M17)","v":{"$error":"#N/A"}},{"$f":"IF(ISBLANK(Planning!N17),NA(),Planning!N17)","v":{"$error":"#N/A"}},{"$f":"IF(ISBLANK(Planning!O17),NA(),Planning!O17)","v":{"$error":"#N/A"}},{"$f":"IF(ISBLANK(Planning!P17),NA(),Planning!P17)","v":{"$error":"#N/A"}},{"$f":"IF(ISBLANK(Planning!Q17),NA(),Planning!Q17)","v":{"$error":"#N/A"}},{"$f":"IF(ISBLANK(Planning!R17),NA(),Planning!R17)","v":{"$error":"#N/A"}},{"$f":"IF(ISBLANK(Planning!S17),NA(),Planning!S17)","v":{"$error":"#N/A"}},{"$f":"IF(ISBLANK(Planning!T17),NA(),Planning!T17)","v":{"$error":"#N/A"}},{"$f":"IF(ISBLANK(Planning!U17),NA(),Planning!U17)","v":{"$error":"#N/A"}}]
[{"$f":"Reporting!A18","v":"Quarterly Demonstrated Reliabilty"},null,{"$f":"IF(OR(ISBLANK(Reporting!B18),Reporting!B18=\"\"),NA(),Reporting!B18)","v":{"$error":"#N/A"}},{"$f":"IF(OR(ISBLANK(Reporting!C18),Reporting!C18=\"\"),NA(),Reporting!C18)","v":{"$error":"#N/A"}},{"$f":"IF(OR(ISBLANK(Reporting!D18),Reporting!D18=\"\"),NA(),Reporting!D18)","v":{"$error":"#N/A"}},{"$f":"IF(OR(ISBLANK(Reporting!E18),Reporting!E18=\"\"),NA(),Reporting!E18)","v":{"$error":"#N/A"}},{"$f":"IF(OR(ISBLANK(Reporting!F18),Reporting!F18=\"\"),NA(),Reporting!F18)","v":{"$error":"#N/A"}},{"$f":"IF(OR(ISBLANK(Reporting!G18),Reporting!G18=\"\"),NA(),Reporting!G18)","v":{"$error":"#N/A"}},{"$f":"IF(OR(ISBLANK(Reporting!H18),Reporting!H18=\"\"),NA(),Reporting!H18)","v":{"$error":"#N/A"}},{"$f":"IF(OR(ISBLANK(Reporting!I18),Reporting!I18=\"\"),NA(),Reporting!I18)","v":{"$error":"#N/A"}},{"$f":"IF(OR(ISBLANK(Reporting!J18),Reporting!J18=\"\"),NA(),Reporting!J18)","v":{"$error":"#N/A"}},{"$f":"IF(OR(ISBLANK(Reporting!K18),Reporting!K18=\"\"),NA(),Reporting!K18)","v":{"$error":"#N/A"}},{"$f":"IF(OR(ISBLANK(Reporting!L18),Reporting!L18=\"\"),NA(),Reporting!L18)","v":{"$error":"#N/A"}},{"$f":"IF(OR(ISBLANK(Reporting!M18),Reporting!M18=\"\"),NA(),Reporting!M18)","v":{"$error":"#N/A"}},{"$f":"IF(OR(ISBLANK(Reporting!N18),Reporting!N18=\"\"),NA(),Reporting!N18)","v":{"$error":"#N/A"}},{"$f":"IF(OR(ISBLANK(Reporting!O18),Reporting!O18=\"\"),NA(),Reporting!O18)","v":{"$error":"#N/A"}},{"$f":"IF(OR(ISBLANK(Reporting!P18),Reporting!P18=\"\"),NA(),Reporting!P18)","v":{"$error":"#N/A"}},{"$f":"IF(OR(ISBLANK(Reporting!Q18),Reporting!Q18=\"\"),NA(),Reporting!Q18)","v":{"$error":"#N/A"}},{"$f":"IF(OR(ISBLANK(Reporting!R18),Reporting!R18=\"\"),NA(),Reporting!R18)","v":{"$error":"#N/A"}},{"$f":"IF(OR(ISBLANK(Reporting!S18),Reporting!S18=\"\"),NA(),Reporting!S18)","v":{"$error":"#N/A"}},{"$f":"IF(OR(ISBLANK(Reporting!T18),Reporting!T18=\"\"),NA(),Reporting!T18)","v":{"$error":"#N/A"}},{"$f":"IF(OR(ISBLANK(Reporting!U18),Reporting!U18=\"\"),NA(),Reporting!U18)","v":{"$error":"#N/A"}}]
[{"$f":"Reporting!A11","v":"Cumulative Demonstrated Reliability Value"},null,{"$f":"IF(ISBLANK(Reporting!B11),NA(),Reporting!B11)","v":{"$error":"#N/A"}},{"$f":"IF(ISBLANK(Reporting!C11),NA(),Reporting!C11)","v":{"$error":"#N/A"}},{"$f":"IF(ISBLANK(Reporting!D11),NA(),Reporting!D11)","v":{"$error":"#N/A"}},{"$f":"IF(ISBLANK(Reporting!E11),NA(),Reporting!E11)","v":{"$error":"#N/A"}},{"$f":"IF(ISBLANK(Reporting!F11),NA(),Reporting!F11)","v":{"$error":"#N/A"}},{"$f":"IF(ISBLANK(Reporting!G11),NA(),Reporting!G11)","v":{"$error":"#N/A"}},{"$f":"IF(ISBLANK(Reporting!H11),NA(),Reporting!H11)","v":{"$error":"#N/A"}},{"$f":"IF(ISBLANK(Reporting!I11),NA(),Reporting!I11)","v":{"$error":"#N/A"}},{"$f":"IF(ISBLANK(Reporting!J11),NA(),Reporting!J11)","v":{"$error":"#N/A"}},{"$f":"IF(ISBLANK(Reporting!K11),NA(),Reporting!K11)","v":{"$error":"#N/A"}},{"$f":"IF(ISBLANK(Reporting!L11),NA(),Reporting!L11)","v":{"$error":"#N/A"}},{"$f":"IF(ISBLANK(Reporting!M11),NA(),Reporting!M11)","v":{"$error":"#N/A"}},{"$f":"IF(ISBLANK(Reporting!N11),NA(),Reporting!N11)","v":{"$error":"#N/A"}},{"$f":"IF(ISBLANK(Reporting!O11),NA(),Reporting!O11)","v":{"$error":"#N/A"}},{"$f":"IF(ISBLANK(Reporting!P11),NA(),Reporting!P11)","v":{"$error":"#N/A"}},{"$f":"IF(ISBLANK(Reporting!Q11),NA(),Reporting!Q11)","v":{"$error":"#N/A"}},{"$f":"IF(ISBLANK(Reporting!R11),NA(),Reporting!R11)","v":{"$error":"#N/A"}},{"$f":"IF(ISBLANK(Reporting!S11),NA(),Reporting!S11)","v":{"$error":"#N/A"}},{"$f":"IF(ISBLANK(Reporting!T11),NA(),Reporting!T11)","v":{"$error":"#N/A"}},{"$f":"IF(ISBLANK(Reporting!U11),NA(),Reporting!U11)","v":{"$error":"#N/A"}}]
[{"$f":"'Optional Reporting'!A11","v":"Current Test Phase - Cumulative Demonstrated Reliability Value"},null,{"$f":"IF(ISBLANK('Optional Reporting'!B11),NA(),'Optional Reporting'!B11)","v":{"$error":"#N/A"}},{"$f":"IF(ISBLANK('Optional Reporting'!C11),NA(),'Optional Reporting'!C11)","v":{"$error":"#N/A"}},{"$f":"IF(ISBLANK('Optional Reporting'!D11),NA(),'Optional Reporting'!D11)","v":{"$error":"#N/A"}},{"$f":"IF(ISBLANK('Optional Reporting'!E11),NA(),'Optional Reporting'!E11)","v":{"$error":"#N/A"}},{"$f":"IF(ISBLANK('Optional Reporting'!F11),NA(),'Optional Reporting'!F11)","v":{"$error":"#N/A"}},{"$f":"IF(ISBLANK('Optional Reporting'!G11),NA(),'Optional Reporting'!G11)","v":{"$error":"#N/A"}},{"$f":"IF(ISBLANK('Optional Reporting'!H11),NA(),'Optional Reporting'!H11)","v":{"$error":"#N/A"}},{"$f":"IF(ISBLANK('Optional Reporting'!I11),NA(),'Optional Reporting'!I11)","v":{"$error":"#N/A"}},{"$f":"IF(ISBLANK('Optional Reporting'!J11),NA(),'Optional Reporting'!J11)","v":{"$error":"#N/A"}},{"$f":"IF(ISBLANK('Optional Reporting'!K11),NA(),'Optional Reporting'!K11)","v":{"$error":"#N/A"}},{"$f":"IF(ISBLANK('Optional Reporting'!L11),NA(),'Optional Reporting'!L11)","v":{"$error":"#N/A"}},{"$f":"IF(ISBLANK('Optional Reporting'!M11),NA(),'Optional Reporting'!M11)","v":{"$error":"#N/A"}},{"$f":"IF(ISBLANK('Optional Reporting'!N11),NA(),'Optional Reporting'!N11)","v":{"$error":"#N/A"}},{"$f":"IF(ISBLANK('Optional Reporting'!O11),NA(),'Optional Reporting'!O11)","v":{"$error":"#N/A"}},{"$f":"IF(ISBLANK('Optional Reporting'!P11),NA(),'Optional Reporting'!P11)","v":{"$error":"#N/A"}},{"$f":"IF(ISBLANK('Optional Reporting'!Q11),NA(),'Optional Reporting'!Q11)","v":{"$error":"#N/A"}},{"$f":"IF(ISBLANK('Optional Reporting'!R11),NA(),'Optional Reporting'!R11)","v":{"$error":"#N/A"}},{"$f":"IF(ISBLANK('Optional Reporting'!S11),NA(),'Optional Reporting'!S11)","v":{"$error":"#N/A"}},{"$f":"IF(ISBLANK('Optional Reporting'!T11),NA(),'Optional Reporting'!T11)","v":{"$error":"#N/A"}},{"$f":"IF(ISBLANK('Optional Reporting'!U11),NA(),'Optional Reporting'!U11)","v":{"$error":"#N/A"}}]
{"$rows_left_out":21}